BDBM31521 Naphthalene and Benzamide Derivative, 21::med.21724, Compound 160
SMILES C[C@@H](N(C)C(=O)c1ccccc1C)c1cccc2ccccc12
InChI Key InChIKey=UENPHAHEZPFPCU-MRXNPFEDSA-N
Data  2 IC50
  Tab Delimited (TSV)   2D SDfile   Computed 3D by Vconf -m prep SDfile
Find this compound or compounds like it in BindingDB:
Activity Spreadsheet -- Enzyme Inhibition Constant Data from BindingDB
Found 2 hits for monomerid = 31521
TargetReplicase polyprotein 1a(Human SARS coronavirus (SARS-CoV))
University Of Bonn
LigandPNGBDBM31521(Naphthalene and Benzamide Derivative, 21 | med.217...)
Affinity DataIC50:  2.26E+4nM. Assay description: This is a review article.
In DepthDetails ArticlePubMed
TargetReplicase polyprotein 1ab [1541-1855](Human SARS coronavirus (SARS-CoV))
Purdue University
LigandPNGBDBM31521(Naphthalene and Benzamide Derivative, 21 | med.217...)
Affinity DataIC50:  2.26E+4nMpH: 7.5 T: 2°C. Assay description: IC50 values for all inhibitors were determined using a 96-well plate based assay. Reactions were performed in buffer containing RLRGG-AMC, 2% DMSO, a...
In DepthDetails ArticlePubMed