BDBM315597 (3-Chloro-pyrazin-2-yl)- [4-fluoro-3-(6- morpholin-4-yl-thieno- [3,2-d}pyrimidin-4-yl)- phenyl]methanol (Ena 1)identical to enantiomer (24)::US10172859, Example 23::US10172859, Example 24::US10172859, Example 37::US11065253, Example 37::US9732094, Example 37
SMILES OC(c1ccc(F)c(c1)-c1ncnc2cc(sc12)N1CCOCC1)c1nccnc1Cl
InChI Key InChIKey=SDVPZFAXJNURBD-UHFFFAOYSA-N
Data  6 KI  9 IC50
  Tab Delimited (TSV)   2D SDfile   Computed 3D by Vconf -m prep SDfile
Find this compound or compounds like it in BindingDB:
Activity Spreadsheet -- Enzyme Inhibition Constant Data from BindingDB
Found 15 hits for monomerid = 315597
TargetPotassium voltage-gated channel subfamily H member 2(Homo sapiens (Human))
Merck Patent
US Patent
LigandPNGBDBM315597((3-Chloro-pyrazin-2-yl)- [4-fluoro-3-(6- morpholin...)
Affinity DataKi:  1.25E+4nM. Assay description: The patch-clamp measurement was carried out at room temperature in whole-cell configuration on human embryonic kidney cells (HEK293) which have been ...
Ligand InfoPC cidPC sid
In DepthDetails US Patent
TargetPotassium voltage-gated channel subfamily H member 2(Homo sapiens (Human))
Merck Patent
US Patent
LigandPNGBDBM315597((3-Chloro-pyrazin-2-yl)- [4-fluoro-3-(6- morpholin...)
Affinity DataKi:  1.25E+4nM. Assay description: Method for the detection and characterisation of test substances which interfere with the Kv11.1 (hERG) channel: Kv11.1 (hERG, human ether a-go-go re...
Ligand InfoPC cidPC sid
In DepthDetails US Patent
TargetPotassium voltage-gated channel subfamily H member 2(Homo sapiens (Human))
Merck Patent
US Patent
LigandPNGBDBM315597((3-Chloro-pyrazin-2-yl)- [4-fluoro-3-(6- morpholin...)
Affinity DataKi:  2.00E+4nM. Assay description: The patch-clamp measurement was carried out at room temperature in whole-cell configuration on human embryonic kidney cells (HEK293) which have been ...
Ligand InfoPC cidPC sid
In DepthDetails US Patent
TargetPotassium voltage-gated channel subfamily H member 2(Homo sapiens (Human))
Merck Patent
US Patent
LigandPNGBDBM315597((3-Chloro-pyrazin-2-yl)- [4-fluoro-3-(6- morpholin...)
Affinity DataKi:  2.00E+4nM. Assay description: Method for the detection and characterisation of test substances which interfere with the Kv11.1 (hERG) channel: Kv11.1 (hERG, human ether a-go-go re...
Ligand InfoPC cidPC sid
In DepthDetails US Patent
TargetPotassium voltage-gated channel subfamily H member 2(Homo sapiens (Human))
Merck Patent
US Patent
LigandPNGBDBM315597((3-Chloro-pyrazin-2-yl)- [4-fluoro-3-(6- morpholin...)
Affinity DataKi: >2.50E+4nM. Assay description: Method for the detection and characterisation of test substances which interfere with the Kv11.1 (hERG) channel: Kv11.1 (hERG, human ether a-go-go re...
Ligand InfoPC cidPC sid
In DepthDetails US Patent
TargetPotassium voltage-gated channel subfamily H member 2(Homo sapiens (Human))
Merck Patent
US Patent
LigandPNGBDBM315597((3-Chloro-pyrazin-2-yl)- [4-fluoro-3-(6- morpholin...)
Affinity DataKi: >2.50E+4nM. Assay description: The patch-clamp measurement was carried out at room temperature in whole-cell configuration on human embryonic kidney cells (HEK293) which have been ...
Ligand InfoPC cidPC sid
In DepthDetails US Patent
TargetDNA-dependent protein kinase catalytic subunit(Homo sapiens (Human))
Merck Patent
US Patent
LigandPNGBDBM315597((3-Chloro-pyrazin-2-yl)- [4-fluoro-3-(6- morpholin...)
Affinity DataIC50:  19nM. Assay description: The kinase assay was carried out in streptavidin-coated 348-well microtitre flashplates. To this end, 1.5 ug of DNA-PK/protein complex and 100 ng of ...
Ligand InfoPC cidPC sid
In DepthDetails US Patent
TargetDNA-dependent protein kinase catalytic subunit(Homo sapiens (Human))
Merck Patent
US Patent
LigandPNGBDBM315597((3-Chloro-pyrazin-2-yl)- [4-fluoro-3-(6- morpholin...)
Affinity DataIC50: <3nM. Assay description: The kinase assay was carried out in streptavidin-coated 348-well microtitre flashplates. To this end, 1.5 μg of DNA-PK/protein complex and 100 n...
Ligand InfoPC cidPC sid
In DepthDetails US Patent
TargetDNA-dependent protein kinase catalytic subunit(Homo sapiens (Human))
Merck Patent
US Patent
LigandPNGBDBM315597((3-Chloro-pyrazin-2-yl)- [4-fluoro-3-(6- morpholin...)
Affinity DataIC50: <3nM. Assay description: The kinase assay was carried out in streptavidin-coated 348-well microtitre flashplates. To this end, 1.5 ug of DNA-PK/protein complex and 100 ng of ...
Ligand InfoPC cidPC sid
In DepthDetails US Patent
TargetDNA-dependent protein kinase catalytic subunit(Homo sapiens (Human))
Merck Patent
US Patent
LigandPNGBDBM315597((3-Chloro-pyrazin-2-yl)- [4-fluoro-3-(6- morpholin...)
Affinity DataIC50: <3nM. Assay description: The kinase assay was carried out in streptavidin-coated 348-well microtitre flashplates. To this end, 1.5 μg of DNA-PK/protein complex and 100 n...
Ligand InfoPC cidPC sid
In DepthDetails US Patent
TargetDNA-dependent protein kinase catalytic subunit(Homo sapiens (Human))
Merck Patent
US Patent
LigandPNGBDBM315597((3-Chloro-pyrazin-2-yl)- [4-fluoro-3-(6- morpholin...)
Affinity DataIC50: <3nM. Assay description: The kinase assay was carried out in streptavidin-coated 348-well microtitre flashplates. To this end, 1.5 μg of DNA-PK/protein complex and 100 n...
Ligand InfoPC cidPC sid
In DepthDetails US Patent
TargetDNA-dependent protein kinase catalytic subunit(Homo sapiens (Human))
Merck Patent
US Patent
LigandPNGBDBM315597((3-Chloro-pyrazin-2-yl)- [4-fluoro-3-(6- morpholin...)
Affinity DataIC50:  18.5nM. Assay description: The kinase assay was carried out in streptavidin-coated 348-well microtitre flashplates. To this end, 1.5 μg of DNA-PK/protein complex and 100 n...
Ligand InfoPC cidPC sid
In DepthDetails US Patent
TargetDNA-dependent protein kinase catalytic subunit(Homo sapiens (Human))
Merck Patent
US Patent
LigandPNGBDBM315597((3-Chloro-pyrazin-2-yl)- [4-fluoro-3-(6- morpholin...)
Affinity DataIC50:  18.5nM. Assay description: The kinase assay was carried out in streptavidin-coated 348-well microtitre flashplates. To this end, 1.5 μg of DNA-PK/protein complex and 100 n...
Ligand InfoPC cidPC sid
In DepthDetails US Patent
TargetDNA-dependent protein kinase catalytic subunit(Homo sapiens (Human))
Merck Patent
US Patent
LigandPNGBDBM315597((3-Chloro-pyrazin-2-yl)- [4-fluoro-3-(6- morpholin...)
Affinity DataIC50: <3nM. Assay description: The kinase assay was carried out in streptavidin-coated 348-well microtitre flashplates. To this end, 1.5 μg of DNA-PK/protein complex and 100 n...
Ligand InfoPC cidPC sid
In DepthDetails US Patent
TargetDNA-dependent protein kinase catalytic subunit(Homo sapiens (Human))
Merck Patent
US Patent
LigandPNGBDBM315597((3-Chloro-pyrazin-2-yl)- [4-fluoro-3-(6- morpholin...)
Affinity DataIC50: <3nM. Assay description: The kinase assay was carried out in streptavidin-coated 348-well microtitre flashplates. To this end, 1.5 ug of DNA-PK/protein complex and 100 ng of ...
Ligand InfoPC cidPC sid
In DepthDetails US Patent