BDBM315623 (6-Chloro-pyridazin-3- yl)-[2,4-difluoro-5-(7- morpholin-4-yl- quinazolin-4-yl)phenyl]- methanol1H NMR (500 MHz, DMSO-d6) ppm = 9.10 (s, 1H), 7.98-7.91 (m, 2H), 7.82 (t, J = 8.1, 1H), 7.58-7.51 (m, 2H), 7.47 (t, J = 10.1, 1H), 7.20 (d, J = 2.3, 1H), 6.78 (d, J = 4.9, 1H) 6.26 (d, J = 4.6, 1H), 3.82- 3.74 (m, 4H), 3.48-3.41 (m, 4H).::US10172859, Example 49::US11065253, Example 49::US9732094, Example 49
SMILES OC(c1ccc(Cl)nn1)c1cc(c(F)cc1F)-c1ncnc2cc(ccc12)N1CCOCC1
InChI Key InChIKey=RYTVQFQGZIKYTM-UHFFFAOYSA-N
Data  2 KI  3 IC50
  Tab Delimited (TSV)   2D SDfile   Computed 3D by Vconf -m prep SDfile
Find this compound or compounds like it in BindingDB:
Activity Spreadsheet -- Enzyme Inhibition Constant Data from BindingDB
Found 5 hits for monomerid = 315623
TargetPotassium voltage-gated channel subfamily H member 2(Homo sapiens (Human))
Merck Patent
US Patent
LigandPNGBDBM315623((6-Chloro-pyridazin-3- yl)-[2,4-difluoro-5-(7- mor...)
Affinity DataKi: >2.50E+4nM. Assay description: The patch-clamp measurement was carried out at room temperature in whole-cell configuration on human embryonic kidney cells (HEK293) which have been ...
Ligand InfoPC cidPC sid
In DepthDetails US Patent
TargetPotassium voltage-gated channel subfamily H member 2(Homo sapiens (Human))
Merck Patent
US Patent
LigandPNGBDBM315623((6-Chloro-pyridazin-3- yl)-[2,4-difluoro-5-(7- mor...)
Affinity DataKi: >2.50E+4nM. Assay description: Method for the detection and characterisation of test substances which interfere with the Kv11.1 (hERG) channel: Kv11.1 (hERG, human ether a-go-go re...
Ligand InfoPC cidPC sid
In DepthDetails US Patent
TargetDNA-dependent protein kinase catalytic subunit(Homo sapiens (Human))
Merck Patent
US Patent
LigandPNGBDBM315623((6-Chloro-pyridazin-3- yl)-[2,4-difluoro-5-(7- mor...)
Affinity DataIC50: <3nM. Assay description: The kinase assay was carried out in streptavidin-coated 348-well microtitre flashplates. To this end, 1.5 μg of DNA-PK/protein complex and 100 n...
Ligand InfoPC cidPC sid
In DepthDetails US Patent
TargetDNA-dependent protein kinase catalytic subunit(Homo sapiens (Human))
Merck Patent
US Patent
LigandPNGBDBM315623((6-Chloro-pyridazin-3- yl)-[2,4-difluoro-5-(7- mor...)
Affinity DataIC50: <3nM. Assay description: The kinase assay was carried out in streptavidin-coated 348-well microtitre flashplates. To this end, 1.5 μg of DNA-PK/protein complex and 100 n...
Ligand InfoPC cidPC sid
In DepthDetails US Patent
TargetDNA-dependent protein kinase catalytic subunit(Homo sapiens (Human))
Merck Patent
US Patent
LigandPNGBDBM315623((6-Chloro-pyridazin-3- yl)-[2,4-difluoro-5-(7- mor...)
Affinity DataIC50: <3nM. Assay description: The kinase assay was carried out in streptavidin-coated 348-well microtitre flashplates. To this end, 1.5 ug of DNA-PK/protein complex and 100 ng of ...
Ligand InfoPC cidPC sid
In DepthDetails US Patent