BDBM315647 (S)-[4-Fluoro-3-(7- morpholin-4-yl- quinazolin-4-yl)phenyl]- (6-methoxypyridazin-3- yl)methanol1H NMR (500 MHz, DMSO-d6) ppm = 9.09 (s, 1H), 7.69 (d, J = 9.2, 1H), 7.66-7.61 (m, 2H), 7.53- 7.50 (m, 2H), 7.41-7.37 (m, 1H), 7.21-7.19 (m, 2H), 6.48 (d, J = 4.4, 1H), 6.02 (d, J = 4.4, 1H), 4.00 (s, 3H), 3.79-3.76 (m, 4H), 3.46-3.42 (m, 4H)::US10172859, Example 72::US11065253, Example 72::US9732094, Example 72
SMILES COc1ccc(nn1)[C@@H](O)c1ccc(F)c(c1)-c1ncnc2cc(ccc12)N1CCOCC1
InChI Key InChIKey=IDTQOMSFKJPUNB-DEOSSOPVSA-N
Data  2 KI  3 IC50
  Tab Delimited (TSV)   2D SDfile   Computed 3D by Vconf -m prep SDfile
Find this compound or compounds like it in BindingDB:
Activity Spreadsheet -- Enzyme Inhibition Constant Data from BindingDB
Found 5 hits for monomerid = 315647
TargetPotassium voltage-gated channel subfamily H member 2(Homo sapiens (Human))
Merck Patent
US Patent
LigandPNGBDBM315647((S)-[4-Fluoro-3-(7- morpholin-4-yl- quinazolin-4-y...)
Affinity DataKi: >2.50E+4nM. Assay description: The patch-clamp measurement was carried out at room temperature in whole-cell configuration on human embryonic kidney cells (HEK293) which have been ...
Ligand InfoPC cidPC sid
In DepthDetails US Patent
TargetPotassium voltage-gated channel subfamily H member 2(Homo sapiens (Human))
Merck Patent
US Patent
LigandPNGBDBM315647((S)-[4-Fluoro-3-(7- morpholin-4-yl- quinazolin-4-y...)
Affinity DataKi: >2.50E+4nM. Assay description: Method for the detection and characterisation of test substances which interfere with the Kv11.1 (hERG) channel: Kv11.1 (hERG, human ether a-go-go re...
Ligand InfoPC cidPC sid
In DepthDetails US Patent
TargetDNA-dependent protein kinase catalytic subunit(Homo sapiens (Human))
Merck Patent
US Patent
LigandPNGBDBM315647((S)-[4-Fluoro-3-(7- morpholin-4-yl- quinazolin-4-y...)
Affinity DataIC50: <3nM. Assay description: The kinase assay was carried out in streptavidin-coated 348-well microtitre flashplates. To this end, 1.5 μg of DNA-PK/protein complex and 100 n...
Ligand InfoPC cidPC sid
In DepthDetails US Patent
TargetDNA-dependent protein kinase catalytic subunit(Homo sapiens (Human))
Merck Patent
US Patent
LigandPNGBDBM315647((S)-[4-Fluoro-3-(7- morpholin-4-yl- quinazolin-4-y...)
Affinity DataIC50: <3nM. Assay description: The kinase assay was carried out in streptavidin-coated 348-well microtitre flashplates. To this end, 1.5 μg of DNA-PK/protein complex and 100 n...
Ligand InfoPC cidPC sid
In DepthDetails US Patent
TargetDNA-dependent protein kinase catalytic subunit(Homo sapiens (Human))
Merck Patent
US Patent
LigandPNGBDBM315647((S)-[4-Fluoro-3-(7- morpholin-4-yl- quinazolin-4-y...)
Affinity DataIC50: <3nM. Assay description: The kinase assay was carried out in streptavidin-coated 348-well microtitre flashplates. To this end, 1.5 ug of DNA-PK/protein complex and 100 ng of ...
Ligand InfoPC cidPC sid
In DepthDetails US Patent