BDBM318019 2-[4-[(4-methoxypyrimidin-2-yl)methyl]piperazin-1-yl]-8-methyl-3,5,6,7-tetrahydropyrido[2,3-d]pyrimidin-4-one::US9624218, Example 13
SMILES COc1ccnc(CN2CCN(CC2)c2nc3N(C)CCCc3c(=O)[nH]2)n1
InChI Key InChIKey=KCPHCJUACXXHDI-UHFFFAOYSA-N
Data  3 IC50
  Tab Delimited (TSV)   2D SDfile   Computed 3D by Vconf -m prep SDfile
Find this compound or compounds like it in BindingDB:
Activity Spreadsheet -- Enzyme Inhibition Constant Data from BindingDB
Found 3 hits for monomerid = 318019
TargetPoly [ADP-ribose] polymerase tankyrase-1(Homo sapiens (Human))
Eli Lilly
US Patent
LigandPNGBDBM318019(2-[4-[(4-methoxypyrimidin-2-yl)methyl]piperazin-1-...)
Affinity DataIC50:  14.9nM. Assay description: The enzymatic activity of hTNKS1 and hTNKS2 is assessed using an enzyme-linked immunosorbent assay (ELISA) which detects poly ADP ribose incorporated...
Ligand InfoPC cidPC sid
In DepthDetails US Patent
TargetPoly [ADP-ribose] polymerase 1(Homo sapiens (Human))
Eli Lilly
US Patent
LigandPNGBDBM318019(2-[4-[(4-methoxypyrimidin-2-yl)methyl]piperazin-1-...)
Affinity DataIC50:  3.47E+3nM. Assay description: The Poly ADP-ribose polymerase 1(PARP1) assay is an ELISA which detects poly ADP ribose incorporated into plate-bound histone protein in a 384-well f...
Ligand InfoPC cidPC sid
In DepthDetails US Patent
TargetPoly [ADP-ribose] polymerase tankyrase-2(Homo sapiens (Human))
Eli Lilly
US Patent
LigandPNGBDBM318019(2-[4-[(4-methoxypyrimidin-2-yl)methyl]piperazin-1-...)
Affinity DataIC50:  12.4nM. Assay description: The enzymatic activity of hTNKS1 and hTNKS2 is assessed using an enzyme-linked immunosorbent assay (ELISA) which detects poly ADP ribose incorporated...
Ligand InfoPC cidPC sid
In DepthDetails US Patent