BDBM319615 7-(2-(4-(benzo[b]thiophen-4-yl)piperazin-1-yl)ethyl)quinolin-2(1H)-one::US10174011, Example 9
SMILES O=c1ccc2ccc(CCN3CCN(CC3)c3cccc4sccc34)cc2[nH]1
InChI Key InChIKey=KWRGINFICPLLIP-UHFFFAOYSA-N
Data  3 IC50  1 EC50
  Tab Delimited (TSV)   2D SDfile   Computed 3D by Vconf -m prep SDfile
Find this compound or compounds like it in BindingDB:
Activity Spreadsheet -- Enzyme Inhibition Constant Data from BindingDB
Found 4 hits for monomerid = 319615
Target5-hydroxytryptamine receptor 1A(Homo sapiens (Human))
Shanghai Institute Of Material Medica, Chinese Academy Of Sciences
US Patent
LigandPNGBDBM319615(7-(2-(4-(benzo[b]thiophen-4-yl)piperazin-1-yl)ethy...)
Affinity DataEC50:  0.972nM. Assay description: The 5-HT1A receptor agonism activity test (The agonism activity of test compounds on 5-HT1A receptor expressing human recombinant 5-HT1A receptor in ...
Ligand InfoPC cidPC sid
In DepthDetails US Patent
TargetD(2) dopamine receptor(Homo sapiens (Human))
Shanghai Institute Of Material Medica, Chinese Academy Of Sciences
US Patent
LigandPNGBDBM319615(7-(2-(4-(benzo[b]thiophen-4-yl)piperazin-1-yl)ethy...)
Affinity DataIC50:  3.39nM. Assay description: The D2 receptor agonism activity test (The agonism activity of test compounds on D2 receptor expressing human recombinant D2 receptor in HEK293 cells...
Ligand InfoPC cidPC sid
In DepthDetails US Patent
Target5-hydroxytryptamine receptor 2A(Homo sapiens (Human))
Shanghai Institute Of Material Medica, Chinese Academy Of Sciences
US Patent
LigandPNGBDBM319615(7-(2-(4-(benzo[b]thiophen-4-yl)piperazin-1-yl)ethy...)
Affinity DataIC50:  95.6nM. Assay description: The 5-HT2A receptor antagonism activity test (The antagonism activity of test compounds on 5-HT2A receptor expressing human recombinant 5-HT2A recept...
Ligand InfoPC cidPC sid
In DepthDetails US Patent
TargetD(2) dopamine receptor(Homo sapiens (Human))
Shanghai Institute Of Material Medica, Chinese Academy Of Sciences
US Patent
LigandPNGBDBM319615(7-(2-(4-(benzo[b]thiophen-4-yl)piperazin-1-yl)ethy...)
Affinity DataIC50:  7.06nM. Assay description: The D2 receptor antagonism activity test (The antagonism activity of test compounds on D2 receptor expressing human recombinant D2 receptor in HEK293...
Ligand InfoPC cidPC sid
In DepthDetails US Patent