BDBM321155 US10174049, Example 22::US10385066, Example 22::US9796729, 22
SMILES CCCn1ccc2cc(cc(C3CC3)c12)N1CCOc2ncnc(N)c2C1=O
InChI Key InChIKey=ZRAUYWHLGWICJK-UHFFFAOYSA-N
Data  3 IC50
  Tab Delimited (TSV)   2D SDfile   Computed 3D by Vconf -m prep SDfile
Find this compound or compounds like it in BindingDB:
Activity Spreadsheet -- Enzyme Inhibition Constant Data from BindingDB
Found 3 hits for monomerid = 321155
TargetDiacylglycerol O-acyltransferase 1(Homo sapiens (Human))
Glaxosmithkline
US Patent
LigandPNGBDBM321155(US10174049, Example 22 | US10385066, Example 22 | ...)
Affinity DataIC50:  1.80nM. Assay description: For inhibition of triacylglycerol product formation, 11 uL reactions were run in white Polyplate-384 (PerkinElmer6007300) starting with a 30 minute p...
In DepthDetails US Patent
TargetDiacylglycerol O-acyltransferase 1(Homo sapiens (Human))
Glaxosmithkline
US Patent
LigandPNGBDBM321155(US10174049, Example 22 | US10385066, Example 22 | ...)
Affinity DataIC50:  1.80nM. Assay description: LE assay: For inhibition of triacylglycerol product formation, 11 uL, reactions were nm in white Polyplate-384 (PerkinElmer6007300) starting with a 3...
In DepthDetails US Patent
TargetDiacylglycerol O-acyltransferase 1(Homo sapiens (Human))
Glaxosmithkline
US Patent
LigandPNGBDBM321155(US10174049, Example 22 | US10385066, Example 22 | ...)
Affinity DataIC50:  1.80nM. Assay description: For inhibition of triacylglycerol product formation, 11 uL reactions were run in white Polyplate-384 (PerkinElmer6007300) starting with a 30 minute p...
In DepthDetails US Patent