BDBM322151 US10183917, Example 33
SMILES OC(=O)c1cnc2CCc3cc(OCc4c(onc4-c4c(Cl)cccc4Cl)C4CC4)ncc3Oc2c1
InChI Key InChIKey=UQYZGCFHAXXODZ-UHFFFAOYSA-N
Data  1 EC50
  Tab Delimited (TSV)   2D SDfile   Computed 3D by Vconf -m prep SDfile
Find this compound or compounds like it in BindingDB:
Activity Spreadsheet -- Enzyme Inhibition Constant Data from BindingDB
Found 1 hit for monomerid = 322151
TargetBile acid receptor(Homo sapiens (Human))
Sunshine Lake Pharma
US Patent
LigandPNGBDBM322151(US10183917, Example 33)
Affinity DataEC50:  18nM. Assay description: Purchasing invitrogen PV4833 kits.First, the required amount of the compound was weighed and dissolved in 100% DMSO at the maximum concentration of 3...
Ligand InfoPC cidPC sid
In DepthDetails US Patent