BDBM322402 (R)-7-methoxy-N-(1'-azaspiro[cyclopropane-1,2'-bicyclo[2.2.2]octan]-3'-yl)benzo[b]thiophene-2-carboxamide::US10183938, Compound (R)-161
SMILES COc1cccc2cc(sc12)C(=O)N[C@@H]1C2CCN(CC2)C11CC1
InChI Key InChIKey=HDVMGKGTLCDZNU-QGZVFWFLSA-N
Data  2 KI
  Tab Delimited (TSV)   2D SDfile   Computed 3D by Vconf -m prep SDfile
Find this compound or compounds like it in BindingDB:
Activity Spreadsheet -- Enzyme Inhibition Constant Data from BindingDB
Found 2 hits for monomerid = 322402
TargetNeuronal acetylcholine receptor subunit alpha-7(Homo sapiens (Human))
Axovant Sciences
US Patent
LigandPNGBDBM322402((R)-7-methoxy-N-(1'-azaspiro[cyclopropane-1,2'-bic...)
Affinity DataKi:  58nM. Assay description: The ability of compounds to displace binding of radioactive ligands from human α7 nAChR was determined, as a measure of the affinity of the comp...
Ligand InfoPC cidPC sid
In DepthDetails US Patent
Target5-hydroxytryptamine receptor 3A(Homo sapiens (Human))
Axovant Sciences
US Patent
LigandPNGBDBM322402((R)-7-methoxy-N-(1'-azaspiro[cyclopropane-1,2'-bic...)
Affinity DataKi:  660nM. Assay description: [3H]BRL 43694 competition binding assay was performed under contract by Cerep Poitiers, France following the methods described in Hope, A. G et al., ...
Ligand InfoPC cidPC sid
In DepthDetails US Patent