BDBM323038 N,1-Dimethyl-4-[({(1R,2R)-2-[4-(5- methyl-1H-pyrazol-3-yl)benzoyl]- cyclohexyl}carbonyl)amino]-1H-pyrazole- 5-carboxamide::US10183947, Example 21::US10508119, Example 21::US11001589, Example 21
SMILES CNC(=O)c1c(NC(=O)[C@@H]2CCCC[C@H]2C(=O)c2ccc(cc2)-c2cc(C)[nH]n2)cnn1C
InChI Key
Data  1 IC50
  Tab Delimited (TSV)   2D SDfile   Computed 3D by Vconf -m prep SDfile
Find this compound or compounds like it in BindingDB:
Activity Spreadsheet -- Enzyme Inhibition Constant Data from BindingDB
Found 1 hit for monomerid = 323038
TargetArachidonate 5-lipoxygenase-activating protein(Homo sapiens (Human))
Astrazeneca
US Patent
LigandPNGBDBM323038(N,1-Dimethyl-4-[({(1R,2R)-2-[4-(5- methyl-1H-pyraz...)
Affinity DataIC50:  230nM. Assay description: Compounds were tested in a competition binding assay using 3H-MK591 as tracer. (Preparation of MK-591 is described in Bioorg. Med. Chem. Lett. 1999, ...
Ligand InfoPC cidPC sid
In DepthDetails US Patent