BDBM32649 amino imidazo-pyridinone, 8
SMILES Cc1nc2nc(N)[nH]c2c(O)c1Cc1ccccc1
InChI Key InChIKey=WAXVALNCIZIFRJ-UHFFFAOYSA-N
Data  1 IC50
  Tab Delimited (TSV)   2D SDfile   Computed 3D by Vconf -m prep SDfile
Find this compound or compounds like it in BindingDB:
Activity Spreadsheet -- Enzyme Inhibition Constant Data from BindingDB
Found 1 hit for monomerid = 32649
TargetBiotin carboxylase(Escherichia coli (strain K12))
Pfizer
LigandPNGBDBM32649(amino imidazo-pyridinone, 8)
Affinity DataIC50:  2.40E+3nMpH: 8.0 T: 2°C. Assay description: Assays were performed in 384-well clear bottom plates (Corning; catalog no. 3702), that contained inhibitor solvated in DMSO. To each well of the pla...
Ligand InfoPC cidPC sid
In DepthDetails ArticlePubMed