BDBM327429 N-(3-{(1R,5S,6r)-3-[3-(4,4-difluoropiperidin-1-yl)propyl]-6-ethyl-3-azabicyclo[3.1.0]hexan-6-yl}phenyl)cyclopropanesulfonamide ::US9663463, 7-(b)
SMILES CCC1([C@H]2CN(CCCN3CCC(F)(F)CC3)C[C@@H]12)c1cccc(NS(=O)(=O)C2CC2)c1
InChI Key InChIKey=UQOVGVROVVETMK-RIKCKFAHSA-N
Data  1 IC50
  Tab Delimited (TSV)   2D SDfile   Computed 3D by Vconf -m prep SDfile
Find this compound or compounds like it in BindingDB:
Activity Spreadsheet -- Enzyme Inhibition Constant Data from BindingDB
Found 1 hit for monomerid = 327429
TargetMu-type opioid receptor(Homo sapiens (Human))
Sanwa Kagaku Kenkyusho
US Patent
LigandPNGBDBM327429(N-(3-{(1R,5S,6r)-3-[3-(4,4-difluoropiperidin-1-yl)...)
Affinity DataIC50:  1.40nM. Assay description: The inhibition ratio of the test substance at the respective concentrations were calculated with setting the reaction value of the well to which DMSO...
Ligand InfoPC cidPC sid
In DepthDetails US Patent