BDBM329413 2-((1S,2S)-2-((2- methyl-5-(pyridin-4- yl)pyrimidin-4-yloxy) methyl)cyclopropyl) quinoline (enantiomer A)::US9663513, 26::US9663513, 27
SMILES Cc1ncc(c(OC[C@H]2C[C@@H]2c2ccc3ccccc3n2)n1)-c1ccncc1
InChI Key InChIKey=FFEFOZHZGCFYEQ-MOPGFXCFSA-N
Data  2 KI
  Tab Delimited (TSV)   2D SDfile   Computed 3D by Vconf -m prep SDfile
Find this compound or compounds like it in BindingDB:
Activity Spreadsheet -- Enzyme Inhibition Constant Data from BindingDB
Found 2 hits for monomerid = 329413
TargetcAMP and cAMP-inhibited cGMP 3',5'-cyclic phosphodiesterase 10A(Homo sapiens (Human))
Merck Sharp & Dohme
US Patent
LigandPNGBDBM329413(2-((1S,2S)-2-((2- methyl-5-(pyridin-4- yl)pyrimidi...)
Affinity DataKi:  0.0200nM. Assay description: The fluorescence polarization assay for cyclic nucleotide phosphodiesterases was performed using an IMAP® FP kit supplied by Molecular Devices, Sunny...
Ligand InfoPC cidPC sid
In DepthDetails US Patent
TargetcAMP and cAMP-inhibited cGMP 3',5'-cyclic phosphodiesterase 10A(Homo sapiens (Human))
Merck Sharp & Dohme
US Patent
LigandPNGBDBM329413(2-((1S,2S)-2-((2- methyl-5-(pyridin-4- yl)pyrimidi...)
Affinity DataKi:  0.930nM. Assay description: The fluorescence polarization assay for cyclic nucleotide phosphodiesterases was performed using an IMAP® FP kit supplied by Molecular Devices, Sunny...
Ligand InfoPC cidPC sid
In DepthDetails US Patent