BDBM32980 2,2-bis(chloranyl)-N-[6-(2-cyanoethyl)cyclohexen-1-yl]-N-(phenylmethyl)ethanamide::2,2-dichloro-N-[6-(2-cyanoethyl)-1-cyclohexenyl]-N-(phenylmethyl)acetamide::MLS001049296::N-Benzyl-2,2-dichloro-N-[6-(2-cyano-ethyl)-cyclohex-1-enyl]-acetamide::N-benzyl-2,2-dichloro-N-[6-(2-cyanoethyl)cyclohexen-1-yl]acetamide::SMR000427669::cid_3556865
SMILES ClC(Cl)C(=O)N(Cc1ccccc1)C1=CCCCC1CCC#N
InChI Key InChIKey=BMUVJZGNCCIHSL-UHFFFAOYSA-N
Data  1 IC50
  Tab Delimited (TSV)   2D SDfile   Computed 3D by Vconf -m prep SDfile
Find this compound or compounds like it in BindingDB:
Activity Spreadsheet -- Enzyme Inhibition Constant Data from BindingDB
Found 1 hit for monomerid = 32980
TargetCoagulation factor XI(Homo sapiens (Human))
Pcmd
Curated by PubChem BioAssay
LigandPNGBDBM32980(2,2-bis(chloranyl)-N-[6-(2-cyanoethyl)cyclohexen-1...)
Affinity DataIC50: >5.00E+4nMpH: 7.4 T: 2°C. Assay description: Factor XIa (0.23 ug/mL) was incubated with Boc-Glu-Ala-Arg-AMC substrate (15 uM) in 10 uL of assay buffer for 2 hr at room temperature. Read fluoresc...
In DepthDetails PCBioAssay