BDBM330296 (S)-methyl (5-(4-(3-methylmorpholino)-6-((4-(methylsulfonyl)piperazin-1-yl)methyl)pyrrolo[2,1-f][1,2,4]triazin-2-yl)-4-(trifluoromethyl)pyridin-2-yl)carbamate::US9724352, I-35
SMILES COC(=O)Nc1cc(c(cn1)-c1nc(N2CCOC[C@@H]2C)c2cc(CN3CCN(CC3)S(C)(=O)=O)cn2n1)C(F)(F)F
InChI Key InChIKey=XBULAPXCKGKHCL-INIZCTEOSA-N
Data  1 IC50
  Tab Delimited (TSV)   2D SDfile   Computed 3D by Vconf -m prep SDfile
Find this compound or compounds like it in BindingDB:
Activity Spreadsheet -- Enzyme Inhibition Constant Data from BindingDB
Found 1 hit for monomerid = 330296
TargetPhosphatidylinositol 3-kinase regulatory subunit alpha(Homo sapiens (Human))
Shanghai Institute Of Material Medica, Chinese Academy Of Sciences
US Patent
LigandPNGBDBM330296((S)-methyl (5-(4-(3-methylmorpholino)-6-((4-(methy...)
Affinity DataIC50:  5.67nM. Assay description: The activity of purified kinase was detected with Kinase-GloŽ Plus kinase luminescent assay by measuring the amount of the remaining Kinase in the so...
Ligand InfoPC cidPC sid
In DepthDetails US Patent