BDBM330307 US9725426, 11
SMILES CN(N)c1nnn[nH]1
InChI Key InChIKey=HVDPTDSBSKNUKK-UHFFFAOYSA-N
Data  1 IC50
  Tab Delimited (TSV)   2D SDfile   Computed 3D by Vconf -m prep SDfile
Find this compound or compounds like it in BindingDB:
Activity Spreadsheet -- Enzyme Inhibition Constant Data from BindingDB
Found 1 hit for monomerid = 330307
TargetCystathionine gamma-lyase(Homo sapiens (Human))
Sova Pharmaceuticals
US Patent
LigandPNGBDBM330307(US9725426, 11)
Affinity DataIC50: <1.00E+4nM. Assay description: Test compounds (from DMSO stock solutions) were added to (final concentrations) 20 ug/ml enzyme solution (human, mouse or rat recombinant CSE) plus 5...
Ligand InfoPC cidPC sid
In DepthDetails US Patent