BDBM332811 US10196390, Compound I-83
SMILES Fc1cccc(c1-c1nc2CNC(=O)c2c(Nc2ccc(CC(=O)NC3CCNCC3)cc2)n1)C(F)(F)F
InChI Key InChIKey=ADZUDEITKDOTQC-UHFFFAOYSA-N
Data  2 KI
  Tab Delimited (TSV)   2D SDfile   Computed 3D by Vconf -m prep SDfile
Find this compound or compounds like it in BindingDB:
Activity Spreadsheet -- Enzyme Inhibition Constant Data from BindingDB
Found 2 hits for monomerid = 332811
TargetNon-receptor tyrosine-protein kinase TYK2(Homo sapiens (Human))
Nimbus Lakshmi
US Patent
LigandPNGBDBM332811(US10196390, Compound I-83)
Affinity DataKi:  55nM. Assay description: The caliper machine employs an off chip mobility shift assay to detect phosphorylated peptide substrates from kinase assays, using microfluidics tech...
Ligand InfoPC cidPC sid
In DepthDetails US Patent
TargetTyrosine-protein kinase JAK2(Homo sapiens (Human))
Nimbus Lakshmi
US Patent
LigandPNGBDBM332811(US10196390, Compound I-83)
Affinity DataKi:  550nM
Ligand InfoPC cidPC sid
In DepthDetails US Patent