BDBM334712 US11040966, Example 4.70::US9732075, Example 4.70::[(2S,3S)-2-(5-Chloro-4-methyl-1H-benzoimidazol-2-yl)-3-methyl-pyrrolidin-1-yl]-[5-(4-fluoro-phenyl)-2-methyl-thiazol-4-yl]-methanone
SMILES C[C@H]1CCN([C@@H]1c1nc2c(C)c(Cl)ccc2[nH]1)C(=O)c1nc(C)sc1-c1ccc(F)cc1
InChI Key InChIKey=JJALNSGVCOGWGJ-QKVFXAPYSA-N
Data  2 IC50
  Tab Delimited (TSV)   2D SDfile   Computed 3D by Vconf -m prep SDfile
Find this compound or compounds like it in BindingDB:
Activity Spreadsheet -- Enzyme Inhibition Constant Data from BindingDB
Found 2 hits for monomerid = 334712
TargetOrexin receptor type 2(Homo sapiens (Human))
Idorsia Pharmaceuticals
US Patent
LigandPNGBDBM334712(US11040966, Example 4.70 | US9732075, Example 4.70...)
Affinity DataIC50:  404nM. Assay description: Chinese hamster ovary (CHO) cells expressing the human orexin-1 receptor and the human orexin-2 receptor, respectively, are grown in culture medium (...
Ligand InfoPC cidPC sid
In DepthDetails US Patent
TargetOrexin/Hypocretin receptor type 1(Homo sapiens (Human))
Idorsia Pharmaceuticals
US Patent
LigandPNGBDBM334712(US11040966, Example 4.70 | US9732075, Example 4.70...)
Affinity DataIC50:  0.600nM. Assay description: Chinese hamster ovary (CHO) cells expressing the human orexin-1 receptor and the human orexin-2 receptor, respectively, are grown in culture medium (...
Ligand InfoPC cidPC sid
In DepthDetails US Patent