BDBM335171 US11040966, Example 6.130::US9732075, Example 6.130::[(S)-2-(6-Chloro-7-methyl-1H-benzoimidazol-2-yl)-4-methyl-ene-pyrrolidin-1-yl]-(4,5-dimethyl-2-[1,2,3]triazol-2-yl-phenyl)-methanone
SMILES Cc1cc(C(=O)N2CC(=C)C[C@H]2c2nc3ccc(Cl)c(C)c3[nH]2)c(cc1C)-n1nccn1
InChI Key InChIKey=ZZUZMFIWZAUINT-NRFANRHFSA-N
Data  2 IC50
  Tab Delimited (TSV)   2D SDfile   Computed 3D by Vconf -m prep SDfile
Find this compound or compounds like it in BindingDB:
Activity Spreadsheet -- Enzyme Inhibition Constant Data from BindingDB
Found 2 hits for monomerid = 335171
TargetOrexin receptor type 2(Homo sapiens (Human))
Idorsia Pharmaceuticals
US Patent
LigandPNGBDBM335171(US11040966, Example 6.130 | US9732075, Example 6.1...)
Affinity DataIC50:  0.600nM. Assay description: Chinese hamster ovary (CHO) cells expressing the human orexin-1 receptor and the human orexin-2 receptor, respectively, are grown in culture medium (...
Ligand InfoPC cidPC sid
In DepthDetails US Patent
TargetOrexin/Hypocretin receptor type 1(Homo sapiens (Human))
Idorsia Pharmaceuticals
US Patent
LigandPNGBDBM335171(US11040966, Example 6.130 | US9732075, Example 6.1...)
Affinity DataIC50:  11nM. Assay description: Chinese hamster ovary (CHO) cells expressing the human orexin-1 receptor and the human orexin-2 receptor, respectively, are grown in culture medium (...
Ligand InfoPC cidPC sid
In DepthDetails US Patent