BDBM335277 US11040966, Example 6.49::US9732075, Example 6.49::[5-(3,4-Dimethyl-phenyl)-2-methyl-thiazol-4-yl]-[(S)-4-methylene-2-(4-methylsulfanyl-1H-benzoimidazol-2-yl)-pyrrolidin-1-yl]-methanone
SMILES CSc1cccc2[nH]c(nc12)[C@@H]1CC(=C)CN1C(=O)c1nc(C)sc1-c1ccc(C)c(C)c1
InChI Key InChIKey=LNVMEGYQWMZUBX-FQEVSTJZSA-N
Data  2 IC50
  Tab Delimited (TSV)   2D SDfile   Computed 3D by Vconf -m prep SDfile
Find this compound or compounds like it in BindingDB:
Activity Spreadsheet -- Enzyme Inhibition Constant Data from BindingDB
Found 2 hits for monomerid = 335277
TargetOrexin receptor type 2(Homo sapiens (Human))
Idorsia Pharmaceuticals
US Patent
LigandPNGBDBM335277(US11040966, Example 6.49 | US9732075, Example 6.49...)
Affinity DataIC50:  1nM. Assay description: Chinese hamster ovary (CHO) cells expressing the human orexin-1 receptor and the human orexin-2 receptor, respectively, are grown in culture medium (...
Ligand InfoPC cidPC sid
In DepthDetails US Patent
TargetOrexin/Hypocretin receptor type 1(Homo sapiens (Human))
Idorsia Pharmaceuticals
US Patent
LigandPNGBDBM335277(US11040966, Example 6.49 | US9732075, Example 6.49...)
Affinity DataIC50:  3nM. Assay description: Chinese hamster ovary (CHO) cells expressing the human orexin-1 receptor and the human orexin-2 receptor, respectively, are grown in culture medium (...
Ligand InfoPC cidPC sid
In DepthDetails US Patent