BDBM335283 US11040966, Example 6.54::US9732075, Example 6.54::[(S)-2-(5-Chloro-4-methyl-1H-benzoimidazol-2-yl)-4-methylene-pyrrolidin-1-yl]-[5-(3,4-dimethyl-phenyl)-2-methyl-thiazol-4-yl]-methanone
SMILES Cc1nc(C(=O)N2CC(=C)C[C@H]2c2nc3c(C)c(Cl)ccc3[nH]2)c(s1)-c1ccc(C)c(C)c1
InChI Key InChIKey=PYDZIRFKTNHXGE-NRFANRHFSA-N
Data  2 IC50
  Tab Delimited (TSV)   2D SDfile   Computed 3D by Vconf -m prep SDfile
Find this compound or compounds like it in BindingDB:
Activity Spreadsheet -- Enzyme Inhibition Constant Data from BindingDB
Found 2 hits for monomerid = 335283
TargetOrexin receptor type 2(Homo sapiens (Human))
Idorsia Pharmaceuticals
US Patent
LigandPNGBDBM335283(US11040966, Example 6.54 | US9732075, Example 6.54...)
Affinity DataIC50:  1nM. Assay description: Chinese hamster ovary (CHO) cells expressing the human orexin-1 receptor and the human orexin-2 receptor, respectively, are grown in culture medium (...
Ligand InfoPC cidPC sid
In DepthDetails US Patent
TargetOrexin/Hypocretin receptor type 1(Homo sapiens (Human))
Idorsia Pharmaceuticals
US Patent
LigandPNGBDBM335283(US11040966, Example 6.54 | US9732075, Example 6.54...)
Affinity DataIC50:  3nM. Assay description: Chinese hamster ovary (CHO) cells expressing the human orexin-1 receptor and the human orexin-2 receptor, respectively, are grown in culture medium (...
Ligand InfoPC cidPC sid
In DepthDetails US Patent