BDBM335331 US11040966, Example 6.99::US9732075, Example 6.99::rac-[2-(7-Chloro-1H-benzoimidazol-2-yl)-4-methylene-pyrrolidin-1-yl]-(2-cyclopropyl-5-m-tolyl-thiazol-4-yl)-methanone
SMILES Cc1cccc(c1)-c1sc(nc1C(=O)N1CC(=C)CC1c1nc2cccc(Cl)c2[nH]1)C1CC1
InChI Key
Data  2 IC50
  Tab Delimited (TSV)   2D SDfile   Computed 3D by Vconf -m prep SDfile
Find this compound or compounds like it in BindingDB:
Activity Spreadsheet -- Enzyme Inhibition Constant Data from BindingDB
Found 2 hits for monomerid = 335331
TargetOrexin receptor type 2(Homo sapiens (Human))
Idorsia Pharmaceuticals
US Patent
LigandPNGBDBM335331(US11040966, Example 6.99 | US9732075, Example 6.99...)
Affinity DataIC50:  1nM. Assay description: Chinese hamster ovary (CHO) cells expressing the human orexin-1 receptor and the human orexin-2 receptor, respectively, are grown in culture medium (...
Ligand InfoPC cidPC sid
In DepthDetails US Patent
TargetOrexin/Hypocretin receptor type 1(Homo sapiens (Human))
Idorsia Pharmaceuticals
US Patent
LigandPNGBDBM335331(US11040966, Example 6.99 | US9732075, Example 6.99...)
Affinity DataIC50:  5nM. Assay description: Chinese hamster ovary (CHO) cells expressing the human orexin-1 receptor and the human orexin-2 receptor, respectively, are grown in culture medium (...
Ligand InfoPC cidPC sid
In DepthDetails US Patent