BDBM335339 US11040966, Example 7.3::US9732075, Example 7.3::[(S)-2-(5-Chloro-1,4-dimethyl-1H-benzoimidazol-2-yl)-2-methyl-pyrrolidin-1-yl]-(5-methyl-2-[1,2,3]triazol-2-yl-phenyl)-methanone and/or [(S)-2-(6-Chloro-1,7-dimethyl-1H-benzoimidazol-2-yl)-2-methyl-pyrrolidin-1-yl]-(5-methyl-2-[1,2,3]triazol-2-yl-phenyl)-methanone (mixture of isomers)
SMILES Cc1ccc(c(c1)C(=O)N1CCC[C@@]1(C)c1nc2c(C)c(Cl)ccc2n1C)-n1nccn1
InChI Key InChIKey=MDIAYXGXQBIAME-DEOSSOPVSA-N
Data  2 IC50
  Tab Delimited (TSV)   2D SDfile   Computed 3D by Vconf -m prep SDfile
Find this compound or compounds like it in BindingDB:
Activity Spreadsheet -- Enzyme Inhibition Constant Data from BindingDB
Found 2 hits for monomerid = 335339
TargetOrexin receptor type 2(Homo sapiens (Human))
Idorsia Pharmaceuticals
US Patent
LigandPNGBDBM335339(US11040966, Example 7.3 | US9732075, Example 7.3 |...)
Affinity DataIC50:  3nM. Assay description: Chinese hamster ovary (CHO) cells expressing the human orexin-1 receptor and the human orexin-2 receptor, respectively, are grown in culture medium (...
Ligand InfoPC cidPC sid
In DepthDetails US Patent
TargetOrexin/Hypocretin receptor type 1(Homo sapiens (Human))
Idorsia Pharmaceuticals
US Patent
LigandPNGBDBM335339(US11040966, Example 7.3 | US9732075, Example 7.3 |...)
Affinity DataIC50:  1nM. Assay description: Chinese hamster ovary (CHO) cells expressing the human orexin-1 receptor and the human orexin-2 receptor, respectively, are grown in culture medium (...
Ligand InfoPC cidPC sid
In DepthDetails US Patent