BDBM337680 3-[3-Fluoro-2-(trifluoromethyl)benzyl]-2,4-dioxo-1-[4-(2-oxotetrahydropyrimidin-1(2H)-yl)phenyl]-1,2,3,4-tetrahydropyrimidine-5-carboxylic acid::US9751843, 55
SMILES OC(=O)c1cn(-c2ccc(cc2)N2CCCNC2=O)c(=O)n(Cc2cccc(F)c2C(F)(F)F)c1=O
InChI Key InChIKey=DLUWXUWMRNDTSV-UHFFFAOYSA-N
Data  1 IC50
  Tab Delimited (TSV)   2D SDfile   Computed 3D by Vconf -m prep SDfile
Find this compound or compounds like it in BindingDB:
Activity Spreadsheet -- Enzyme Inhibition Constant Data from BindingDB
Found 1 hit for monomerid = 337680
TargetChymase(Homo sapiens (Human))
Bayer Pharma Aktiengesellschaft
US Patent
LigandPNGBDBM337680(3-[3-Fluoro-2-(trifluoromethyl)benzyl]-2,4-dioxo-1...)
Affinity DataIC50:  222nM. Assay description: The enzyme source used is recombinant human chymase (expressed in HEK293 cells) or chymase purified from hamsters' tongues. The substrate used fo...
Ligand InfoPC cidPC sid
In DepthDetails US Patent