BDBM337768 1-[2-Methyl-4-(2-oxo-1,3-oxazolidin-3-yl)phenyl]-3-[2-methyl-3-(trifluoromethyl)benzyl]-2,4-dioxo-1,2,3,4-tetrahydropyrimidine-5-carboxylic acid::US9751843, 161
SMILES Cc1cc(ccc1-n1cc(C(O)=O)c(=O)n(Cc2cccc(c2C)C(F)(F)F)c1=O)N1CCOC1=O
InChI Key InChIKey=QISKBRAKLNFNEI-UHFFFAOYSA-N
Data  1 IC50
  Tab Delimited (TSV)   2D SDfile   Computed 3D by Vconf -m prep SDfile
Find this compound or compounds like it in BindingDB:
Activity Spreadsheet -- Enzyme Inhibition Constant Data from BindingDB
Found 1 hit for monomerid = 337768
TargetChymase(Homo sapiens (Human))
Bayer Pharma Aktiengesellschaft
US Patent
LigandPNGBDBM337768(1-[2-Methyl-4-(2-oxo-1,3-oxazolidin-3-yl)phenyl]-3...)
Affinity DataIC50:  60nM. Assay description: The enzyme source used is recombinant human chymase (expressed in HEK293 cells) or chymase purified from hamsters' tongues. The substrate used fo...
Ligand InfoPC cidPC sid
In DepthDetails US Patent