BDBM339631 US10202339, Compound 76
SMILES Fc1ccc(NC(=O)Nc2cc(ccc2-c2ccccc2)S(=O)(=O)NCC(F)(F)F)c(c1)C(F)(F)F
InChI Key InChIKey=HSQONJXLXPKJPF-UHFFFAOYSA-N
Data  1 IC50
  Tab Delimited (TSV)   2D SDfile   Computed 3D by Vconf -m prep SDfile
Find this compound or compounds like it in BindingDB:
Activity Spreadsheet -- Enzyme Inhibition Constant Data from BindingDB
Found 1 hit for monomerid = 339631
TargetIsocitrate dehydrogenase [NADP], mitochondrial [R140Q](Homo sapiens (Human))
Agios Pharmaceuticals
US Patent
LigandPNGBDBM339631(US10202339, Compound 76)
Affinity DataIC50:  550nM. Assay description: Compounds were assayed for IDH2 R140Q inhibitory activity through a cofactor depletion assay. Compounds were preincubated with enzyme, then the react...
Ligand InfoPC cidPC sid
In DepthDetails US Patent