BDBM340449 US9758538, Example 139
SMILES Nc1ncc(cn1)-c1nc(nc(N[C@@]2(CO)CCN(C2)C(=O)OCCF)c1F)N1CCOCC1
InChI Key InChIKey=CXNUFILXWITCCI-FQEVSTJZSA-N
Data  1 KI
  Tab Delimited (TSV)   2D SDfile   Computed 3D by Vconf -m prep SDfile
Find this compound or compounds like it in BindingDB:
Activity Spreadsheet -- Enzyme Inhibition Constant Data from BindingDB
Found 1 hit for monomerid = 340449
TargetPhosphatidylinositol 3-kinase regulatory subunit alpha(Homo sapiens (Human))
Pfizer
US Patent
LigandPNGBDBM340449(US9758538, Example 139)
Affinity DataKi: <0.0180nM. Assay description: The biochemical assays of kinase activity of full-length PI3Kα (full-length p110α/p85α) or truncated PI3Kα (p110α/iSH2 p85&#...
Ligand InfoPC cidPC sid
In DepthDetails US Patent