BDBM342694 5-[4-(2-Chloro-4-fluoro-benzoyl)-piperazin-1-ylmethyl]-thiophene-2-carboxylic acid 2-trifluoromethyl-benzylamide::US9776991, Example 64
SMILES Fc1ccc(C(=O)N2CCN(Cc3ccc(s3)C(=O)NCc3ccccc3C(F)(F)F)CC2)c(Cl)c1
InChI Key InChIKey=DGZAPUJXFWRLNM-UHFFFAOYSA-N
Data  1 IC50
  Tab Delimited (TSV)   2D SDfile   Computed 3D by Vconf -m prep SDfile
Find this compound or compounds like it in BindingDB:
Activity Spreadsheet -- Enzyme Inhibition Constant Data from BindingDB
Found 1 hit for monomerid = 342694
TargetBifunctional epoxide hydrolase 2(Homo sapiens (Human))
Sanofi
US Patent
LigandPNGBDBM342694(5-[4-(2-Chloro-4-fluoro-benzoyl)-piperazin-1-ylmet...)
Affinity DataIC50:  1.25nM. Assay description: Compounds were tested in a biochemical screening assay using recombinant sEH purified from Sf9 insect cells and an artificial substrate, (3-phenyl-ox...
Ligand InfoPC cidPC sid
In DepthDetails US Patent