BDBM342705 5-[4-(1-Phenyl-cyclopropanecarbonyl)-piperazin-1-ylmethyl]-thiophene-2-carboxylic acid 2-trifluoromethyl-benzylamide::US9776991, Example 75
SMILES FC(F)(F)c1ccccc1CNC(=O)c1ccc(CN2CCN(CC2)C(=O)C2(CC2)c2ccccc2)s1
InChI Key InChIKey=VWEPONFYXMSERL-UHFFFAOYSA-N
Data  1 IC50
  Tab Delimited (TSV)   2D SDfile   Computed 3D by Vconf -m prep SDfile
Find this compound or compounds like it in BindingDB:
Activity Spreadsheet -- Enzyme Inhibition Constant Data from BindingDB
Found 1 hit for monomerid = 342705
TargetBifunctional epoxide hydrolase 2(Homo sapiens (Human))
Sanofi
US Patent
LigandPNGBDBM342705(5-[4-(1-Phenyl-cyclopropanecarbonyl)-piperazin-1-y...)
Affinity DataIC50:  2.55nM. Assay description: Compounds were tested in a biochemical screening assay using recombinant sEH purified from Sf9 insect cells and an artificial substrate, (3-phenyl-ox...
Ligand InfoPC cidPC sid
In DepthDetails US Patent