BDBM343012 4-(2-cyano-3'-fluoro-5-methoxy-4-biphenylyl)-N-3-isoxazolyl-7-quinazolinesulfonamide::US9776995, Example 203
SMILES COc1cc(-c2cccc(F)c2)c(cc1-c1ncnc2cc(ccc12)S(=O)(=O)Nc1ccon1)C#N
InChI Key InChIKey=VVJWBHPXVFFNPF-UHFFFAOYSA-N
Data  2 IC50
  Tab Delimited (TSV)   2D SDfile   Computed 3D by Vconf -m prep SDfile
Find this compound or compounds like it in BindingDB:
Activity Spreadsheet -- Enzyme Inhibition Constant Data from BindingDB
Found 2 hits for monomerid = 343012
TargetSodium channel protein type 5 subunit alpha(Homo sapiens (Human))
Amgen
US Patent
LigandPNGBDBM343012(4-(2-cyano-3'-fluoro-5-methoxy-4-biphenylyl)-N-3-i...)
Affinity DataIC50: >1.00E+4nM. Assay description: 293 cells stably transfected with Nav 1.5 were recorded in whole cell voltage clamp mode with the PatchXpress automated electrophysiology system acco...
Ligand InfoPC cidPC sid
In DepthDetails US Patent
TargetSodium channel protein type 9 subunit alpha(Homo sapiens (Human))
Amgen
US Patent
LigandPNGBDBM343012(4-(2-cyano-3'-fluoro-5-methoxy-4-biphenylyl)-N-3-i...)
Affinity DataIC50:  28.8nM. Assay description: HEK 293 cells stably transfected with human Nav1.7 were recorded in whole cell voltage clamp mode with the PatchXpress automated electrophysiology sy...
Ligand InfoPC cidPC sid
In DepthDetails US Patent