BDBM343142 4-(2,3'-dichloro-5'-fluoro-5-methoxy-4-biphenylyl)-N-3-isoxazolyl-7-quinazolinesulfonamide::US9776995, Example 310
SMILES COc1cc(c(Cl)cc1-c1ncnc2cc(ccc12)S(=O)(=O)Nc1ccon1)-c1cc(F)cc(Cl)c1
InChI Key InChIKey=WTDBZIMXJLGBHJ-UHFFFAOYSA-N
Data  1 IC50
  Tab Delimited (TSV)   2D SDfile   Computed 3D by Vconf -m prep SDfile
Find this compound or compounds like it in BindingDB:
Activity Spreadsheet -- Enzyme Inhibition Constant Data from BindingDB
Found 1 hit for monomerid = 343142
TargetSodium channel protein type 9 subunit alpha(Homo sapiens (Human))
Amgen
US Patent
LigandPNGBDBM343142(4-(2,3'-dichloro-5'-fluoro-5-methoxy-4-biphenylyl)...)
Affinity DataIC50:  45nM. Assay description: HEK 293 cells stably transfected with human Nav1.7 were recorded in whole cell voltage clamp mode with the PatchXpress automated electrophysiology sy...
Ligand InfoPC cidPC sid
In DepthDetails US Patent