BDBM34732 2-methylbenzo-1,4-quinone 4-[O-(3,4,5-trimethoxybenzoyl)oxime]::3,4,5-trimethoxybenzoic acid [(3-methyl-4-oxo-1-cyclohexa-2,5-dienylidene)amino] ester::3,4,5-trimethoxybenzoic acid [(4-keto-3-methyl-cyclohexa-2,5-dien-1-ylidene)amino] ester::MLS000577188::SMR000197297::[(3-methyl-4-oxidanylidene-cyclohexa-2,5-dien-1-ylidene)amino] 3,4,5-trimethoxybenzoate::[(3-methyl-4-oxocyclohexa-2,5-dien-1-ylidene)amino] 3,4,5-trimethoxybenzoate::cid_710787
SMILES COc1cc(cc(OC)c1OC)C(=O)ON=C1C=CC(=O)C(C)=C1
InChI Key InChIKey=ZXKWLZOEJKQYPH-UHFFFAOYSA-N
Data  5 IC50
  Tab Delimited (TSV)   2D SDfile   Computed 3D by Vconf -m prep SDfile
Find this compound or compounds like it in BindingDB:
Activity Spreadsheet -- Enzyme Inhibition Constant Data from BindingDB
Found 5 hits for monomerid = 34732
TargetMannose-6-phosphate isomerase(Homo sapiens (Human))
Burnham Center For Chemical Genomics
Curated by PubChem BioAssay
LigandPNGBDBM34732(2-methylbenzo-1,4-quinone 4-[O-(3,4,5-trimethoxybe...)
Affinity DataIC50: >5.00E+4nMpH: 7.4 T: 2°C. Assay description: The purpose of this assay is to identify non-competititve inhibitors of human PMI. This is accomplished by using a G6PD- NADPH-coupled assay. In the ...
In DepthDetails PCBioAssay
TargetCoagulation factor XII(Homo sapiens (Human))
Pcmd
Curated by PubChem BioAssay
LigandPNGBDBM34732(2-methylbenzo-1,4-quinone 4-[O-(3,4,5-trimethoxybe...)
Affinity DataIC50:  623nM. Assay description: Molecular Library Screening Center Network (MLSCN) Penn Center for Molecular Discovery (PCMD) Assay Provider: Scott L. Diamond, University of Pennsy...
In DepthDetails PCBioAssay
TargetDNA damage-inducible transcript 3 protein(Mus musculus)
Emory University
Curated by PubChem BioAssay
LigandPNGBDBM34732(2-methylbenzo-1,4-quinone 4-[O-(3,4,5-trimethoxybe...)
Affinity DataIC50:  1.55E+3nM. Assay description: NIH Molecular Libraries Screening Centers Network [MLSCN] Emory Chemical Biology Discovery Center in MLSCN Assay provider: Dr. Randal Kaufman, Univer...
In DepthDetails PCBioAssay
TargetX-box-binding protein 1(Homo sapiens (Human))
Emory University
Curated by PubChem BioAssay
LigandPNGBDBM34732(2-methylbenzo-1,4-quinone 4-[O-(3,4,5-trimethoxybe...)
Affinity DataIC50:  1.00E+4nM. Assay description: NIH Molecular Libraries Screening Centers Network [MLSCN] Emory Chemical Biology Discovery Center in MLSCN Assay provider: Dr. Randal Kaufman, Univer...
In DepthDetails PCBioAssay
TargetDNA damage-inducible transcript 3 protein(Mus musculus)
Emory University
Curated by PubChem BioAssay
LigandPNGBDBM34732(2-methylbenzo-1,4-quinone 4-[O-(3,4,5-trimethoxybe...)
Affinity DataIC50:  1.55E+3nM. Assay description: NIH Molecular Libraries Screening Centers Network [MLSCN] Emory Chemical Biology Discovery Center in MLSCN Assay provider: Dr. Randal Kaufman, Univer...
In DepthDetails PCBioAssay