BDBM35032 benzothienopyrimidinone deriv., 14q
SMILES CN(C)Cc1nc2c3cc(ccc3sc2c(=O)[nH]1)-c1cc(Cl)cc(Cl)c1
InChI Key InChIKey=VBYJPHHGLQMMJE-UHFFFAOYSA-N
Data  2 KI
  Tab Delimited (TSV)   2D SDfile   Computed 3D by Vconf -m prep SDfile
Find this compound or compounds like it in BindingDB:
Activity Spreadsheet -- Enzyme Inhibition Constant Data from BindingDB
Found 2 hits for monomerid = 35032
TargetSerine/threonine-protein kinase pim-1(Homo sapiens (Human))
Abbott Laboratories
LigandPNGBDBM35032(benzothienopyrimidinone deriv., 14q)
Affinity DataKi:  4nM ΔG°:  -11.4kcal/moleT: 2°C. Assay description: In 384-well v-bottom polypropylene plates, compound (2% DMSO) was mixed with Pim kinase and peptide substrate, followed by immediate initiation with ...
In DepthDetails ArticlePubMed
TargetSerine/threonine-protein kinase pim-2(Homo sapiens (Human))
Abbott Laboratories
LigandPNGBDBM35032(benzothienopyrimidinone deriv., 14q)
Affinity DataKi: >1.42E+3nM ΔG°: >-7.97kcal/moleT: 2°C. Assay description: In 384-well v-bottom polypropylene plates, compound (2% DMSO) was mixed with Pim kinase and peptide substrate, followed by immediate initiation with ...
In DepthDetails ArticlePubMed