BDBM350841 UNC1536A::US9795606, A5
SMILES CCCCNc1ncc2c(cn(C[C@H]3CC[C@H](N)CC3)c2n1)-c1ccc(c(F)c1)S(=O)(=O)N1CCOCC1
InChI Key InChIKey=POJHPGOEGZTUPC-XUTJKUGGSA-N
Data  1 IC50
  Tab Delimited (TSV)   2D SDfile   Computed 3D by Vconf -m prep SDfile
Find this compound or compounds like it in BindingDB:
Activity Spreadsheet -- Enzyme Inhibition Constant Data from BindingDB
Found 1 hit for monomerid = 350841
TargetTyrosine-protein kinase Mer(Homo sapiens (Human))
University Of North Carolina At Chapel Hill
US Patent
LigandPNGBDBM350841(UNC1536A | US9795606, A5)
Affinity DataIC50: <250nM. Assay description: The ectopic expression of Mer receptor tyrosine kinase (Mer) has been identified as a tumor cell survival gene product in Acute Lymphoblastic Leukemi...
Ligand InfoPC cidPC sid
In DepthDetails US Patent