BDBM351787 US9796716, Compound 31
SMILES Cn1nc(-c2ccc(Oc3cccc(COc4ccccc4C(F)(F)F)c3)cc2)c2c(N)ncnc12
InChI Key InChIKey=JOKYKWRDVMCIED-UHFFFAOYSA-N
Data  1 KI
  Tab Delimited (TSV)   2D SDfile   Computed 3D by Vconf -m prep SDfile
Find this compound or compounds like it in BindingDB:
Activity Spreadsheet -- Enzyme Inhibition Constant Data from BindingDB
Found 1 hit for monomerid = 351787
TargetTyrosine-protein kinase BTK(Homo sapiens (Human))
Pharmascience
US Patent
LigandPNGBDBM351787(US9796716, Compound 31)
Affinity DataKi: <100nM. Assay description: Fluorescence polarization-based kinase assays were performed in 384 well-plate format using histidine tagged recombinant human full-length Bruton Aga...
Ligand InfoPC cidPC sid
In DepthDetails US Patent