BDBM35271 tripeptide-based inhibitor, 14n
SMILES CC(C)[C@H](NC(=O)CN1CCN(CC(O)=O)C(=O)C1=O)C(=O)N1CCC[C@H]1C(=O)N[C@@H](C(C)C)C(=O)c1nc2ccccc2o1
InChI Key InChIKey=TXXXXYGJIKZIRL-IGKWTDBASA-N
Data  1 IC50
  Tab Delimited (TSV)   2D SDfile   Computed 3D by Vconf -m prep SDfile
Find this compound or compounds like it in BindingDB:
Activity Spreadsheet -- Enzyme Inhibition Constant Data from BindingDB
Found 1 hit for monomerid = 35271
TargetNeutrophil elastase(Homo sapiens (Human))
Dainippon Sumitomo Pharma
LigandPNGBDBM35271(tripeptide-based inhibitor, 14n)
Affinity DataIC50:  30nMpH: 7.5 T: 2°C. Assay description: To evaluate inhibitory effect of test compound, HNE was preincubated with each compound in the assay solution at 37 deg C for 4 min. The reaction was...
In DepthDetails ArticlePubMed