BDBM356132 US9815846, Compound 132
SMILES CC(=O)NCc1cccc(c1)-c1nc(C)ncc1NC(=O)c1cc(-c2ccn(C)n2)c(cc1F)C(F)(F)F
InChI Key InChIKey=KFPGLFOXLHTKOR-UHFFFAOYSA-N
Data  1 IC50
  Tab Delimited (TSV)   2D SDfile   Computed 3D by Vconf -m prep SDfile
Find this compound or compounds like it in BindingDB:
Activity Spreadsheet -- Enzyme Inhibition Constant Data from BindingDB
Found 1 hit for monomerid = 356132
TargetHigh affinity nerve growth factor receptor(Homo sapiens (Human))
Merck Sharp & Dohme
US Patent
LigandPNGBDBM356132(US9815846, Compound 132)
Affinity DataIC50:  16nM. Assay description: TrkA functional activity was measured using a DiscoverX PathHunter assay. In this assay, U2OS cells express the human TrkA receptor as a fusion with ...
Ligand InfoPC cidPC sid
In DepthDetails US Patent