BDBM35705 5H-1-benzazepin-5-ylidene acetamide, 10l
SMILES FC1(F)CCN(C(=O)c2ccc(cc2Cl)N2CCCCC2)c2ccccc2\C1=C\C(=O)NCc1ccccn1
InChI Key InChIKey=XADVQFSTTKQUDH-PLRJNAJWSA-N
Data  1 KI  1 EC50
  Tab Delimited (TSV)   2D SDfile   Computed 3D by Vconf -m prep SDfile
Find this compound or compounds like it in BindingDB:
Activity Spreadsheet -- Enzyme Inhibition Constant Data from BindingDB
Found 1 hit for monomerid = 35705
TargetVasopressin V2 receptor(Homo sapiens (Human))
Astellas Pharma
LigandPNGBDBM35705(5H-1-benzazepin-5-ylidene acetamide, 10l)
Affinity DataKi:  14nM ΔG°:  -10.6kcal/mole EC50:  104nMpH: 7.4 T: 2°C. Assay description: The affinities of test compounds for human V2 receptor were evaluated by the radioligand binding study using membrane fractions isolated from CHO cel...
In DepthDetails ArticlePubMed