BDBM3585 4-[(3-Bromophenyl)amino]benzo[g]quinazoline::Benzoquinazoline deriv. 23::CHEMBL63786::N-(3-bromophenyl)benzo[g]quinazolin-4-amine
SMILES Brc1cccc(Nc2ncnc3cc4ccccc4cc23)c1
InChI Key InChIKey=BUVKJPOCMOXSSQ-UHFFFAOYSA-N
Data  2 IC50
  Tab Delimited (TSV)   2D SDfile   Computed 3D by Vconf -m prep SDfile
Find this compound or compounds like it in BindingDB:
Activity Spreadsheet -- Enzyme Inhibition Constant Data from BindingDB
Found 2 hits for monomerid = 3585
TargetFructose-1,6-bisphosphatase 1(Homo sapiens (Human))
Pfizer
Curated by ChEMBL
LigandPNGBDBM3585(4-[(3-Bromophenyl)amino]benzo[g]quinazoline | Benz...)
Affinity DataIC50:  7.50E+3nM. Assay description: Concentration required to inhibit the human liver recombinant fructose-1,6-bisphosphatase.
In DepthDetails ArticlePubMed
TargetEpidermal growth factor receptor(Homo sapiens (Human))
University Of Auckland
LigandPNGBDBM3585(4-[(3-Bromophenyl)amino]benzo[g]quinazoline | Benz...)
Affinity DataIC50:  0.00300nMpH: 7.4 T: 2°C. Assay description: IC50 is the inhibitor concentration which inhibits 50% of kinase activity that catalyzes the transfer of the terminal phosphate from [gamma-32P] labe...
In DepthDetails ArticlePubMed