BDBM358673 N-(3-(4-(3-(4-amino-5-cyanopyrrolo [2,1-f][1,2,4]triazin-7-yl)phenyl)-2,2- dimethyl-3-oxopiperazin-1-yl)-3- oxopropyl)methanesulfonamide::US10214537, Example 750
SMILES CC1(C)N(CCN(C1=O)c1cccc(c1)-c1cc(C#N)c2c(N)ncnn12)C(=O)CCNS(C)(=O)=O
InChI Key InChIKey=VQTFAGBLYMBTLF-UHFFFAOYSA-N
Data  1 IC50
  Tab Delimited (TSV)   2D SDfile   Computed 3D by Vconf -m prep SDfile
Find this compound or compounds like it in BindingDB:
Activity Spreadsheet -- Enzyme Inhibition Constant Data from BindingDB
Found 1 hit for monomerid = 358673
TargetPhosphatidylinositol 4,5-bisphosphate 3-kinase catalytic subunit delta isoform(Homo sapiens (Human))
Bristol-Myers Squibb
US Patent
LigandPNGBDBM358673(N-(3-(4-(3-(4-amino-5-cyanopyrrolo [2,1-f][1,2,4]t...)
Affinity DataIC50:  0.600nM. Assay description: The ADP-Glo format PI3K assays were performed in Proxiplate 384-well plates (Perkin Elmer #6008280). The final assay volume was 2 μl prepared fr...
Ligand InfoPC cidPC sid
In DepthDetails US Patent