BDBM35885 flufenamic acid tricyclic analogue, 9
SMILES OC(=O)c1ccc(c2c1[nH]c1ccccc1c2=O)C(F)(F)F
InChI Key InChIKey=ALQVPSZZGLMOIY-UHFFFAOYSA-N
Data  1 IC50
  Tab Delimited (TSV)   2D SDfile   Computed 3D by Vconf -m prep SDfile
Find this compound or compounds like it in BindingDB:
Activity Spreadsheet -- Enzyme Inhibition Constant Data from BindingDB
Found 1 hit for monomerid = 35885
TargetAndrogen receptor(Homo sapiens (Human))
St. Jude Research Hospital
LigandPNGBDBM35885(flufenamic acid tricyclic analogue, 9)
Affinity DataIC50:  1.03E+4nMpH: 7.2 T: 2°C. Assay description: A radiolabeled ligand competition scintillation proximity assay (SPA) for the androgen receptor (AR) using Ni-coated 384-well FlashPlates. It measure...
Ligand InfoPC cidPC sid
In DepthDetails ArticlePubMed