BDBM35890 flufenamic acid analogue, 17
SMILES CCCCCCOc1ccc(Nc2ccccc2C(O)=O)cc1
InChI Key InChIKey=JKZQPQIMGVHZRH-UHFFFAOYSA-N
Data  1 IC50
  Tab Delimited (TSV)   2D SDfile   Computed 3D by Vconf -m prep SDfile
Find this compound or compounds like it in BindingDB:
Activity Spreadsheet -- Enzyme Inhibition Constant Data from BindingDB
Found 1 hit for monomerid = 35890
TargetAndrogen receptor(Homo sapiens (Human))
St. Jude Research Hospital
LigandPNGBDBM35890(flufenamic acid analogue, 17)
Affinity DataIC50:  4.40E+3nMpH: 7.2 T: 2°C. Assay description: A radiolabeled ligand competition scintillation proximity assay (SPA) for the androgen receptor (AR) using Ni-coated 384-well FlashPlates. It measure...
In DepthDetails ArticlePubMed