BDBM35895 flufenamic acid analogue, 22
SMILES CCCCCOC(=O)c1ccc(Nc2ccccc2C(O)=O)cc1
InChI Key InChIKey=RCABLKCPSGGJHX-UHFFFAOYSA-N
Data  1 IC50  1 EC50
  Tab Delimited (TSV)   2D SDfile   Computed 3D by Vconf -m prep SDfile
Find this compound or compounds like it in BindingDB:
Activity Spreadsheet -- Enzyme Inhibition Constant Data from BindingDB
Found 1 hit for monomerid = 35895
TargetAndrogen receptor(Homo sapiens (Human))
St. Jude Research Hospital
LigandPNGBDBM35895(flufenamic acid analogue, 22)
Affinity DataIC50:  6.70E+3nM EC50:  1.37E+4nMpH: 7.2 T: 2°C. Assay description: A radiolabeled ligand competition scintillation proximity assay (SPA) for the androgen receptor (AR) using Ni-coated 384-well FlashPlates. It measure...
Ligand InfoPC cidPC sid
In DepthDetails ArticlePubMed