BDBM3593 4-[(3-Bromophenyl)amino]-7-fluoropyrido[4,3-d]pyrimidine::CHEMBL51707::N-(3-bromophenyl)-7-fluoropyrido[4,3-d]pyrimidin-4-amine::Pyrido[4,3-d]pyrimidine 5e
SMILES Fc1cc2ncnc(Nc3cccc(Br)c3)c2cn1
InChI Key InChIKey=ZSEDCGVJIAHLRN-UHFFFAOYSA-N
Data  1 IC50
  Tab Delimited (TSV)   2D SDfile   Computed 3D by Vconf -m prep SDfile
Find this compound or compounds like it in BindingDB:
Activity Spreadsheet -- Enzyme Inhibition Constant Data from BindingDB
Found 1 hit for monomerid = 3593
TargetEpidermal growth factor receptor(Homo sapiens (Human))
University Of Auckland
LigandPNGBDBM3593(4-[(3-Bromophenyl)amino]-7-fluoropyrido[4,3-d]pyri...)
Affinity DataIC50:  13nMpH: 7.4 T: 2°C. Assay description: IC50 is the inhibitor concentration which inhibits 50% of kinase activity that catalyzes the transfer of the terminal phosphate from [gamma-32P] labe...
In DepthDetails ArticlePubMed