BDBM36000 3,5-dichlorobenzene-1-sulfonamide::SPR_4
SMILES NS(=O)(=O)c1cc(Cl)cc(Cl)c1
InChI Key InChIKey=AHNOVNYOUPQVRX-UHFFFAOYSA-N
Data  1 Kd  1 Koff  1 Kon
PDB links: 2 PDB IDs match this monomer.
  Tab Delimited (TSV)   2D SDfile   Computed 3D by Vconf -m prep SDfile
Find this compound or compounds like it in BindingDB:
Activity Spreadsheet -- Enzyme Inhibition Constant Data from BindingDB
Found 1 hit for monomerid = 36000
TargetCarbonic anhydrase 2(Bos taurus)
University Of Dundee
LigandPNGBDBM36000(3,5-dichlorobenzene-1-sulfonamide | SPR_4)
Affinity DataKd:  287nM Kon:  9.02E+5M-1s-1 Koff:  0.259s-1pH: 7.4 T: 2°C. Assay description: SPR biosensor assay Biacore T100
In DepthDetails