BDBM36007 3-chloro-5-fluoro-2-methylbenzene-1-sulfonamide::SPR_11
SMILES Cc1c(Cl)cc(F)cc1S(N)(=O)=O
InChI Key InChIKey=GQXCKIZUZLAIPV-UHFFFAOYSA-N
Data  1 Kd  1 Koff  1 Kon
  Tab Delimited (TSV)   2D SDfile   Computed 3D by Vconf -m prep SDfile
Find this compound or compounds like it in BindingDB:
Activity Spreadsheet -- Enzyme Inhibition Constant Data from BindingDB
Found 1 hit for monomerid = 36007
TargetCarbonic anhydrase 2(Bos taurus)
University Of Dundee
LigandPNGBDBM36007(3-chloro-5-fluoro-2-methylbenzene-1-sulfonamide | ...)
Affinity DataKd:  96.8nM Kon:  7.88E+5M-1s-1 Koff:  0.0763s-1pH: 7.4 T: 2°C. Assay description: SPR biosensor assay Biacore T100
In DepthDetails