BDBM3602 4-[(3-Bromophenyl)amino]-6-fluoropyrido[3,4-d]pyrimidine::CHEMBL53121::N-(3-bromophenyl)-6-fluoropyrido[3,4-d]pyrimidin-4-amine::Pyrido[3,4-d]pyrimidine 7e
SMILES Fc1cc2c(Nc3cccc(Br)c3)ncnc2cn1
InChI Key InChIKey=KRRHOFYUUHSVEQ-UHFFFAOYSA-N
Data  2 IC50
  Tab Delimited (TSV)   2D SDfile   Computed 3D by Vconf -m prep SDfile
Find this compound or compounds like it in BindingDB:
Activity Spreadsheet -- Enzyme Inhibition Constant Data from BindingDB
Found 2 hits for monomerid = 3602
TargetEpidermal growth factor receptor(Homo sapiens (Human))
University Of Zurich
Curated by ChEMBL
LigandPNGBDBM3602(4-[(3-Bromophenyl)amino]-6-fluoropyrido[3,4-d]pyri...)
Affinity DataIC50:  126nM. Assay description: Inhibition of EGFR
In DepthDetails ArticlePubMed
TargetEpidermal growth factor receptor(Homo sapiens (Human))
University Of Zurich
Curated by ChEMBL
LigandPNGBDBM3602(4-[(3-Bromophenyl)amino]-6-fluoropyrido[3,4-d]pyri...)
Affinity DataIC50:  124nMpH: 7.4 T: 2°C. Assay description: IC50 is the inhibitor concentration which inhibits 50% of kinase activity that catalyzes the transfer of the terminal phosphate from [gamma-32P] labe...
In DepthDetails ArticlePubMed