BDBM360775 (2S,4R)-1-(2-(3-acetyl-5- ((3-cyano-1H-pyrazol-4- yl)ethynyl)-1H-indol-1- yl)acetyl)-N-(3-chloro-2- fluorobenzyl)-4- fluoropyrrolidine-2- carboxamide::US9828396, Compound 24
SMILES CC(=O)c1cn(CC(=O)N2C[C@H](F)C[C@H]2C(=O)NCc2cccc(Cl)c2F)c2ccc(cc12)C#Cc1c[nH]nc1C#N
InChI Key InChIKey=MMJIDWGXPOQWEY-ZBLYBZFDSA-N
Data  1 IC50
  Tab Delimited (TSV)   2D SDfile   Computed 3D by Vconf -m prep SDfile
Find this compound or compounds like it in BindingDB:
Activity Spreadsheet -- Enzyme Inhibition Constant Data from BindingDB
Found 1 hit for monomerid = 360775
TargetComplement factor D(Homo sapiens (Human))
Achillion Pharmaceuticals
US Patent
LigandPNGBDBM360775((2S,4R)-1-(2-(3-acetyl-5- ((3-cyano-1H-pyrazol-4- ...)
Affinity DataIC50: <1.00E+3nM. Assay description: Human factor D (purified from human serum, Complement Technology, Inc.) at 80 nM final concentration is incubated with test compound at various conce...
Ligand InfoPC cidPC sid
In DepthDetails US Patent