BDBM3614 4-[(3-bromophenyl)amino]-7-methoxypyrido[2,3-d]pyrimidine::CHEMBL301549::N-(3-bromophenyl)-7-methoxypyrido[2,3-d]pyrimidin-4-amine::Pyrido[2,3-d]pyrimidine 9h
SMILES COc1ccc2c(Nc3cccc(Br)c3)ncnc2n1
InChI Key InChIKey=OQQQTEPDBHVQDX-UHFFFAOYSA-N
Data  2 IC50
  Tab Delimited (TSV)   2D SDfile   Computed 3D by Vconf -m prep SDfile
Find this compound or compounds like it in BindingDB:
Activity Spreadsheet -- Enzyme Inhibition Constant Data from BindingDB
Found 2 hits for monomerid = 3614
TargetEpidermal growth factor receptor(Homo sapiens (Human))
University Of Zurich
Curated by ChEMBL
LigandPNGBDBM3614(4-[(3-bromophenyl)amino]-7-methoxypyrido[2,3-d]pyr...)
Affinity DataIC50:  263nM. Assay description: Inhibition of EGFR
In DepthDetails ArticlePubMed
TargetEpidermal growth factor receptor(Homo sapiens (Human))
University Of Zurich
Curated by ChEMBL
LigandPNGBDBM3614(4-[(3-bromophenyl)amino]-7-methoxypyrido[2,3-d]pyr...)
Affinity DataIC50:  263nM. Assay description: IC50 is the inhibitor concentration which inhibits 50% of kinase activity that catalyzes the transfer of the terminal phosphate from [gamma-32P] labe...
In DepthDetails ArticlePubMed