BDBM36299 4-chlorophenol
SMILES Oc1ccc(Cl)cc1
InChI Key InChIKey=WXNZTHHGJRFXKQ-UHFFFAOYSA-N
Data  1 KI  1 EC50  1 ITC
PDB links: 5 PDB IDs match this monomer.
  Tab Delimited (TSV)   2D SDfile   Computed 3D by Vconf -m prep SDfile
Find this compound or compounds like it in BindingDB:
Activity Spreadsheet -- Enzyme Inhibition Constant Data from BindingDB
Found 2 hits for monomerid = 36299
TargetOxysterols receptor LXR-beta(Homo sapiens (Human))
Sun Yat-Sen University
Curated by ChEMBL
LigandPNGBDBM36299(4-chlorophenol)
Affinity DataKi:  1.69E+5nM. Assay description: Binding affinity to recombinant human LXRbeta-LBD expressed in Escherichia coli BL21 (DE3) assessed as inhibitory constant incubated for 30 mins by f...
In DepthDetails ArticlePubMed
TargetOxysterols receptor LXR-beta(Homo sapiens (Human))
Sun Yat-Sen University
Curated by ChEMBL
LigandPNGBDBM36299(4-chlorophenol)
Affinity DataEC50:  5.14E+5nM. Assay description: Agonist activity at recombinant human LXRbeta-LBD expressed in Escherichia coli BL21 (DE3) assessed as peptide D22 recruitment fluorescence polarizat...
In DepthDetails ArticlePubMed
Activity Spreadsheet -- ITC Data from BindingDB
Found 1 hit for monomerid = 36299
HostPNGBDBM36284(BDBM36303 | BDBM36310 | Methyl Viologen-Cucurbit[8...)
University Of Cambridge
GuestPNGBDBM36299(4-chlorophenol)
ITC DataΔG°: -5.61kcal/mole logk: 1.30E+4
pH: 7.0 T: 25.00°C